"primaryid","caseid","i_f_code","i_f_code_num","foll_seq","image","event_dt","event_dt_num","mfr_dt","mfr_dt_num","fda_dt","fda_dt_num","rept_cod","rept_cod_num","mfr_num","mfr_sndr","age","age_cod","sex","e_sub","wt","wt_cod","rept_dt","rept_dt_num","occp_cod","death_dt","to_mfr","confid","occp_cod_num"
4263257,5709722,"I",72,,"4263257-6",,,20031224,12/24/2003,20040105,1/5/2004,"EXP",698880,"US-GLAXOSMITHKLINE-A0490813A","GLAXOSMITHKLINE",,,,"Y",,,20040105,1/5/2004,"OT",,,,7984
4264430,4055009,"F",70,,"4264430-3",,,20031126,11/26/2003,20040106,1/6/2004,"EXP",698880,"US-GLAXOSMITHKLINE-B0316252A","GLAXOSMITHKLINE",38,"YR","F","Y",,,20040106,1/6/2004,"CN",,,,6778
4264435,5709724,"F",70,,"4264435-2",,,20031212,12/12/2003,20040106,1/6/2004,"EXP",698880,"US-GLAXOSMITHKLINE-B0317415A","GLAXOSMITHKLINE",40,"YR","F","Y",,,20040106,1/6/2004,"CN",,,,6778
4267515,5709731,"I",72,,"4267515-0",20030716,7/16/2003,20030718,7/18/2003,20040109,1/9/2004,"PER",806982,"US-GLAXOSMITHKLINE-A0418060A","GLAXOSMITHKLINE",66,"YR","F","Y",,,20040109,1/9/2004,"CN",,,,6778
4267527,5709730,"F",70,,"4267527-7",,,20030805,8/5/2003,20040109,1/9/2004,"PER",806982,"US-GLAXOSMITHKLINE-A0420764A","GLAXOSMITHKLINE",,,"M","Y",,,20040109,1/9/2004,"CN",,,,6778
4267586,5709729,"I",72,,"4267586-1",20030801,8/1/2003,20030919,9/19/2003,20040109,1/9/2004,"PER",806982,"US-GLAXOSMITHKLINE-A0426582A","GLAXOSMITHKLINE",59,"YR","F","Y",,,20040109,1/9/2004,"CN",,,,6778
4267816,4025410,"F",70,,"4267816-6",,,20031103,11/3/2003,20040109,1/9/2004,"EXP",698880,"US-GLAXOSMITHKLINE-A0432608A","GLAXOSMITHKLINE",81,"YR","F","Y",68.1999969482422,"KG",20040109,1/9/2004,"CN",,,,6778
4270017,5709742,"F",70,,"4270017-9",,,20020828,8/28/2002,20040114,1/14/2004,"PER",806982,"US-GLAXOSMITHKLINE-A0379391A","GLAXOSMITHKLINE",,,"F","Y",,,20040114,1/14/2004,"CN",,,,6778
4270046,5709741,"I",72,,"4270046-5",,,20030110,1/10/2003,20040114,1/14/2004,"PER",806982,"US-GLAXOSMITHKLINE-A0392337A","GLAXOSMITHKLINE",,,,"Y",,,20040114,1/14/2004,"CN",,,,6778
4270052,5709740,"I",72,,"4270052-0",,,20030123,1/23/2003,20040114,1/14/2004,"PER",806982,"US-GLAXOSMITHKLINE-A0393998A","GLAXOSMITHKLINE",52,"YR","F","Y",,,20040114,1/14/2004,"CN",,,,6778
4270065,5709739,"F",70,,"4270065-9",,,20030204,2/4/2003,20040114,1/14/2004,"PER",806982,"US-GLAXOSMITHKLINE-A0395449A","GLAXOSMITHKLINE",59,"YR","F","Y",,,20040114,1/14/2004,"MD",,,,7768
4270080,5709738,"I",72,,"4270080-5",20030101,1/1/2003,20030210,2/10/2003,20040114,1/14/2004,"PER",806982,"US-GLAXOSMITHKLINE-A0396049A","GLAXOSMITHKLINE",48,"YR","M","Y",,,20040114,1/14/2004,"CN",,,,6778
4270097,5709737,"F",70,,"4270097-0",,,20030305,3/5/2003,20040114,1/14/2004,"PER",806982,"US-GLAXOSMITHKLINE-A0399087A","GLAXOSMITHKLINE",,,,"Y",,,20040114,1/14/2004,"MD",,,,7768
4270142,5709735,"F",70,,"4270142-2",,,20030507,5/7/2003,20040114,1/14/2004,"PER",806982,"US-GLAXOSMITHKLINE-A0408075A","GLAXOSMITHKLINE",,,"F","Y",,,20040114,1/14/2004,"CN",,,,6778
4270144,5709734,"I",72,,"4270144-6",20030503,5/3/2003,20030516,5/16/2003,20040114,1/14/2004,"PER",806982,"US-GLAXOSMITHKLINE-A0408689A","GLAXOSMITHKLINE",,,"F","Y",,,20040114,1/14/2004,"CN",,,,6778
4270153,5709733,"F",70,,"4270153-7",20030510,5/10/2003,20030606,6/6/2003,20040114,1/14/2004,"PER",806982,"US-GLAXOSMITHKLINE-A0411924A","GLAXOSMITHKLINE",,,"F","Y",,,20040114,1/14/2004,"CN",,,,6778
4270171,5709732,"I",72,,"4270171-9",,,20030625,6/25/2003,20040114,1/14/2004,"PER",806982,"US-GLAXOSMITHKLINE-A0414002A","GLAXOSMITHKLINE",,,"M","Y",,,20040114,1/14/2004,"CN",,,,6778
4273114,5709722,"F",70,,"4273114-7",,,20031224,12/24/2003,20040116,1/16/2004,"EXP",698880,"US-GLAXOSMITHKLINE-A0490813A","GLAXOSMITHKLINE",,,,"Y",,,20040116,1/16/2004,"OT",,,,7984
4280108,5707257,"I",72,,"4280108-4",20030401,4/1/2003,20031219,12/19/2003,20040126,1/26/2004,"EXP",698880,"M2004.6855","SANDOZ INC.",29,"YR","M","N",43,"KG",20040122,1/22/2004,,20030401,,,
4280202,4073351,"I",72,,"4280202-8",20031229,12/29/2003,20040122,1/22/2004,20040128,1/28/2004,"EXP",698880,"NL-GLAXOSMITHKLINE-B0320703A","GLAXOSMITHKLINE",47,"YR","M","Y",,,20040128,1/28/2004,"CN",,,,6778
4280525,5704923,"I",72,,"4280525-2",20021010,10/10/2002,20040114,1/14/2004,20040127,1/27/2004,"EXP",698880,"2002AP03309","ASTRAZENECA PHARMACEUTICALS",62,"YR","F","N",,,20040126,1/26/2004,,,,,
4281601,5707260,"F",70,"1","4281601-0",20030730,7/30/2003,20031008,10/8/2003,20040128,1/28/2004,"EXP",698880,"M2003.6125","SANDOZ, INC.",49,"YR","F","N",31,"KG",20040126,1/26/2004,"MD",20030730,,,7768
4305706,5704924,"I",72,,"4305706-0",,,20040216,2/16/2004,20040225,2/25/2004,"EXP",698880,"2004UW02713","ASTRAZENECA PHARMACEUTICALS",66,"YR","M","N",,,20040224,2/24/2004,"MD",,,,7768
4315801,5704925,"I",72,,"4315801-8",20030111,1/11/2003,20040227,2/27/2004,20040310,3/10/2004,"EXP",698880,"2003PK00196","ASTRAZENECA PHARMACEUTICALS",80,"YR","F","N",62.4000015258789,"KG",20040308,3/8/2004,,,,,
4328626,4115011,"F",70,,"4328626-4",20030903,9/3/2003,20040318,3/18/2004,20040401,4/1/2004,"EXP",698880,"200412222US","AVENTIS PHARMACEUTICALS, INC.",62,"YR","M","Y",,,20040401,4/1/2004,"OT",,,,7984
4328627,4110297,"F",70,,"4328627-6",20040312,3/12/2004,20040316,3/16/2004,20040401,4/1/2004,"EXP",698880,"200410861EU","AVENTIS PHARMACEUTICALS, INC.",63,"YR","F","Y",,,20040401,4/1/2004,"OT",,,,7984
4328633,4117215,"F",70,,"4328633-1",,,20040209,2/9/2004,20040401,4/1/2004,"EXP",698880,"PHHO2004PH02206","NOVARTIS PHARMACEUTICALS CORP.",49,"YR","F","Y",,,20040329,3/29/2004,"MD",20030924,,,7768
4328634,4117216,"I",72,,"4328634-3",20040106,1/6/2004,20040324,3/24/2004,20040401,4/1/2004,"EXP",698880,"PHHO2004PA04494","NOVARTIS PHARMACEUTICALS CORP.",32,"YR","F","Y",81,"KG",20040329,3/29/2004,"MD",20040211,,,7768
4328635,4117217,"I",72,,"4328635-5",20031101,11/1/2003,20040325,3/25/2004,20040401,4/1/2004,"EXP",698880,"PHBS2004AT04082","NOVARTIS PHARMACEUTICALS CORP.",14,"YR","F","Y",,,20040329,3/29/2004,"MD",,,,7768
4328639,4117218,"I",72,,"4328639-2",20040316,3/16/2004,20040325,3/25/2004,20040401,4/1/2004,"EXP",698880,"PHBS2004JP04125","NOVARTIS PHARMACEUTICALS CORP.",34,"YR","F","Y",,,20040330,3/30/2004,"MD",,,,7768
4328640,4117219,"I",72,,"4328640-9",,,20040325,3/25/2004,20040401,4/1/2004,"EXP",698880,"PHBS2004CA04083","NOVARTIS PHARMACEUTICALS CORP.",,,,"Y",,,20040331,3/31/2004,"MD",,,,7768
4328641,4087062,"F",70,,"4328641-0",,,20040205,2/5/2004,20040401,4/1/2004,"EXP",698880,"PHEH2004US01619","NOVARTIS PHARMACEUTICALS CORP.",85,"YR","M","Y",,,20040330,3/30/2004,"MD",,,,7768
4328642,4117221,"I",72,,"4328642-2",,,20040324,3/24/2004,20040401,4/1/2004,"EXP",698880,"PHBS2004PE04084","NOVARTIS PHARMACEUTICALS CORP.",,,"F","Y",,,20040331,3/31/2004,"MD",,,,7768
4328643,4109475,"F",70,,"4328643-4",20040201,2/1/2004,20040310,3/10/2004,20040401,4/1/2004,"EXP",698880,"PHBS2004JP03367","NOVARTIS PHARMACEUTICALS CORP.",75,"YR","M","Y",69,"KG",20040331,3/31/2004,"MD",,,,7768
4328644,4040829,"F",70,,"4328644-6",20030602,6/2/2003,20031205,12/5/2003,20040401,4/1/2004,"EXP",698880,"PHHO2003AR15706","NOVARTIS PHARMACEUTICALS CORP.",68,"YR","F","Y",53,"KG",20040329,3/29/2004,"MD",20031112,,,7768
4328646,4117223,"F",70,,"4328646-X",20040109,1/9/2004,20040305,3/5/2004,20040401,4/1/2004,"EXP",698880,"PHEH2004US02759","NOVARTIS PHARMACEUTICALS CORP.",47,"YR","M","Y",,,20040331,3/31/2004,,,,,
4328647,4117225,"I",72,,"4328647-1",20030601,6/1/2003,20040323,3/23/2004,20040401,4/1/2004,"EXP",698880,"PHEH2004US03371","NOVARTIS PHARMACEUTICALS CORP.",55,"YR","M","Y",,,20040331,3/31/2004,,,,,
4328648,4117226,"I",72,,"4328648-3",,,20040322,3/22/2004,20040401,4/1/2004,"EXP",698880,"PHEH2004US03404","NOVARTIS PHARMACEUTICALS CORP.",,,"M","Y",,,20040331,3/31/2004,,,,,
4328649,4117227,"I",72,,"4328649-5",20030101,1/1/2003,20040324,3/24/2004,20040401,4/1/2004,"EXP",698880,"PHEH2004US03396","NOVARTIS PHARMACEUTICALS CORP.",60,"YR","F","Y",,,20040331,3/31/2004,"CN",,,,6778
4328650,4100373,"F",70,,"4328650-1",20040201,2/1/2004,20040223,2/23/2004,20040401,4/1/2004,"EXP",698880,"PHBS2004JP02555","NOVARTIS PHARMACEUTICALS CORP.",78,"YR","M","Y",45,"KG",20040331,3/31/2004,"MD",,,,7768
4328651,4117230,"I",72,,"4328651-3",,,20040324,3/24/2004,20040401,4/1/2004,"EXP",698880,"PHEH2004US03475","NOVARTIS PHARMACEUTICALS CORP.",,,"M","Y",,,20040331,3/31/2004,"CN",,,,6778
4328652,3717245,"F",70,,"4328652-5",20001014,10/14/2000,20010919,9/19/2001,20040401,4/1/2004,"EXP",698880,"10994291","BRISTOL-MYERS SQUIBB COMPANY",1,"DY","F","Y",3,"KG",20040401,4/1/2004,"OT",,,,7984
4328653,4115082,"F",70,,"4328653-7",20000201,2/1/2000,20040317,3/17/2004,20040401,4/1/2004,"EXP",698880,"FR-BRISTOL-MYERS SQUIBB COMPANY-12539854","BRISTOL-MYERS SQUIBB COMPANY",54,"YR","M","Y",,,20040401,4/1/2004,"OT",,,,7984
4328855,4117293,"I",72,,"4328855-X",,,20040326,3/26/2004,20040401,4/1/2004,"EXP",698880,"US-BRISTOL-MYERS SQUIBB COMPANY-12543625","BRISTOL-MYERS SQUIBB COMPANY",79,"YR","F","Y",,,20040401,4/1/2004,"MD",,,,7768
4328863,4109055,"F",70,,"4328863-9",20040216,2/16/2004,20040308,3/8/2004,20040401,4/1/2004,"EXP",698880,"GB-BRISTOL-MYERS SQUIBB COMPANY-12526406","BRISTOL-MYERS SQUIBB COMPANY",67,"YR","F","Y",,,20040401,4/1/2004,"OT",,,,7984
4328865,4117296,"I",72,,"4328865-2",,,20040323,3/23/2004,20040401,4/1/2004,"EXP",698880,"GB-BRISTOL-MYERS SQUIBB COMPANY-12542130","BRISTOL-MYERS SQUIBB COMPANY",,,"M","Y",,,20040401,4/1/2004,"PH",,,,8072
4328866,4117297,"I",72,,"4328866-4",,,20040324,3/24/2004,20040401,4/1/2004,"EXP",698880,"200411286FR","AVENTIS PHARMACEUTICALS, INC.",45,"YR","F","Y",,,20040401,4/1/2004,"MD",,,,7768
4328867,4112353,"F",70,,"4328867-6",20031215,12/15/2003,20031218,12/18/2003,20040401,4/1/2004,"EXP",698880,"200311535JP","AVENTIS PHARMACEUTICALS, INC.",55,"YR","M","Y",50,"KG",20040401,4/1/2004,"MD",,,,7768
4328868,4097594,"F",70,,"4328868-8",20040215,2/15/2004,20040216,2/16/2004,20040401,4/1/2004,"EXP",698880,"200410421JP","AVENTIS PHARMACEUTICALS, INC.",21,"YR","F","Y",43,"KG",20040401,4/1/2004,"OT",,,,7984
4328869,4117298,"I",72,,"4328869-X",20040121,1/21/2004,20040317,3/17/2004,20040401,4/1/2004,"EXP",698880,"200410947JP","AVENTIS PHARMACEUTICALS, INC.",65,"YR","M","Y",54,"KG",20040401,4/1/2004,"MD",,,,7768
4328870,4088968,"F",70,,"4328870-6",20030929,9/29/2003,20031031,10/31/2003,20040401,4/1/2004,"EXP",698880,"200311289JP","AVENTIS PHARMACEUTICALS, INC.",48,"YR","M","Y",77,"KG",20040401,4/1/2004,"OT",20040224,,,7984
4328877,4039257,"F",70,,"4328877-9",20031113,11/13/2003,20031125,11/25/2003,20040401,4/1/2004,"EXP",698880,"200311398JP","AVENTIS PHARMACEUTICALS, INC.",44,"YR","F","Y",60,"KG",20040401,4/1/2004,"OT",,,,7984
4328878,3961788,"F",70,,"4328878-0",,,20030602,6/2/2003,20040401,4/1/2004,"EXP",698880,"200315123US","AVENTIS PHARMACEUTICALS, INC.",,,"F","Y",97.3000030517578,"KG",20040401,4/1/2004,"LW",,,,7687
4328879,4117302,"F",70,,"4328879-2",20040204,2/4/2004,20040210,2/10/2004,20040401,4/1/2004,"EXP",698880,"200410324JP","AVENTIS PHARMACEUTICALS, INC.",68,"YR","M","Y",60,"KG",20040401,4/1/2004,"MD",,,,7768
4328904,4047827,"F",70,,"4328904-9",20031120,11/20/2003,20031215,12/15/2003,20040401,4/1/2004,"EXP",698880,"JP-BRISTOL-MYERS SQUIBB COMPANY-12462669","BRISTOL-MYERS SQUIBB COMPANY",87,"YR","M","Y",,,20040401,4/1/2004,"MD",,,,7768
4328906,4108432,"F",70,,"4328906-2",,,20040107,1/7/2004,20040401,4/1/2004,"EXP",698880,"US-BRISTOL-MYERS SQUIBB COMPANY-12472882","BRISTOL-MYERS SQUIBB COMPANY",36,"YR","M","Y",,,20040401,4/1/2004,"OT",,,,7984
4329060,4117336,"I",72,,"4329060-3",20040207,2/7/2004,20040323,3/23/2004,20040401,4/1/2004,"EXP",698880,"JP-BRISTOL-MYERS SQUIBB COMPANY-12539631","BRISTOL-MYERS SQUIBB COMPANY",58,"YR","M","Y",,,20040401,4/1/2004,"OT",,,,7984
4329062,4117338,"I",72,,"4329062-7",20040326,3/26/2004,20040326,3/26/2004,20040401,4/1/2004,"EXP",698880,"FR-BRISTOL-MYERS SQUIBB COMPANY-12544227","BRISTOL-MYERS SQUIBB COMPANY",60,"YR","M","Y",,,20040401,4/1/2004,"MD",,,,7768
4329130,4117351,"F",70,,"4329130-X",20040129,1/29/2004,20040211,2/11/2004,20040401,4/1/2004,"EXP",698880,"US-BRISTOL-MYERS SQUIBB COMPANY-12503652","BRISTOL-MYERS SQUIBB COMPANY",69,"YR","F","Y",,,20040401,4/1/2004,"OT",,,,7984
4329169,4117360,"I",72,,"4329169-4",20030901,9/1/2003,20040323,3/23/2004,20040401,4/1/2004,"EXP",698880,"200412270US","AVENTIS PHARMACEUTICALS, INC.",69,"YR","F","Y",,,20040401,4/1/2004,"MD",,,,7768
4329170,4117361,"I",72,,"4329170-0",20040214,2/14/2004,20040322,3/22/2004,20040401,4/1/2004,"EXP",698880,"200411167FR","AVENTIS PHARMACEUTICALS, INC.",78,"YR","F","Y",90,"KG",20040401,4/1/2004,,,,,
4329171,4117362,"I",72,,"4329171-2",,,20040322,3/22/2004,20040401,4/1/2004,"EXP",698880,"200412225US","AVENTIS PHARMACEUTICALS, INC.",,,"M","Y",,,20040401,4/1/2004,"CN",,,,6778
4329172,4117363,"I",72,,"4329172-4",20040227,2/27/2004,20040324,3/24/2004,20040401,4/1/2004,"EXP",698880,"200411233FR","AVENTIS PHARMACEUTICALS, INC.",85,"YR","F","Y",80,"KG",20040401,4/1/2004,,,,,
4329173,4117364,"I",72,,"4329173-6",20040201,2/1/2004,20040325,3/25/2004,20040401,4/1/2004,"EXP",698880,"200411249FR","AVENTIS PHARMACEUTICALS, INC.",83,"YR","F","Y",,,20040401,4/1/2004,"MD",,,,7768
4329174,4117365,"I",72,,"4329174-8",20040216,2/16/2004,20040326,3/26/2004,20040401,4/1/2004,"EXP",698880,"200413573GDDC","AVENTIS PHARMACEUTICALS, INC.",29,"YR","M","Y",53.5,"KG",20040401,4/1/2004,,,,,
4329175,4087497,"F",70,,"4329175-X",20040112,1/12/2004,20040121,1/21/2004,20040401,4/1/2004,"EXP",698880,"200410489US","AVENTIS PHARMACEUTICALS, INC.",,,"F","Y",,,20040401,4/1/2004,"MD",20040112,,,7768
4329176,4117909,"F",70,,"4329176-1",20030412,4/12/2003,20030616,6/16/2003,20040401,4/1/2004,"EXP",698880,"200312406FR","AVENTIS PHARMACEUTICALS, INC.",36,"YR","F","Y",,,20040401,4/1/2004,,,,,
4329177,4110430,"F",70,,"4329177-3",20040301,3/1/2004,20040316,3/16/2004,20040401,4/1/2004,"EXP",698880,"200413185GDDC","AVENTIS PHARMACEUTICALS, INC.",50,"YR","M","Y",,,20040401,4/1/2004,"OT",20040308,,,7984
4329178,4094402,"F",70,,"4329178-5",,,20040220,2/20/2004,20040401,4/1/2004,"EXP",698880,"200412441GDDC","AVENTIS PHARMACEUTICALS, INC.",,,"M","Y",,,20040401,4/1/2004,"PH",,,,8072
4329467,4115380,"F",70,,"4329467-4",20010701,7/1/2001,20020516,5/16/2002,20040401,4/1/2004,"EXP",698880,"US-MERCK-0205USA02027","MERCK HUMAN HEALTH DIVISION",66,"YR","F","Y",125,"KG",20040401,4/1/2004,"MD",,,,7768
4329468,4117495,"F",70,,"4329468-6",20040218,2/18/2004,20040219,2/19/2004,20040401,4/1/2004,"EXP",698880,"JP-MERCK-0402USA01816","MERCK HUMAN HEALTH DIVISION",75,"YR","M","Y",,,20040401,4/1/2004,"MD",,,,7768
4329470,4117497,"F",70,,"4329470-4",20010130,1/30/2001,20030306,3/6/2003,20040401,4/1/2004,"EXP",698880,"US-MERCK-0303USA00625","MERCK HUMAN HEALTH DIVISION",56,"YR","M","Y",64,"KG",20040401,4/1/2004,"MD",20010414,,,7768
4329471,4117498,"I",72,,"4329471-6",,,20040329,3/29/2004,20040401,4/1/2004,"EXP",698880,"CA-MERCK-0403CAN00189","MERCK HUMAN HEALTH DIVISION",50,"YR","M","Y",,,20040401,4/1/2004,"PH",,,,8072
4329473,4117499,"I",72,,"4329473-X",20040326,3/26/2004,20040326,3/26/2004,20040401,4/1/2004,"EXP",698880,"US-MERCK-0403USA02453","MERCK HUMAN HEALTH DIVISION",65,"YR","F","Y",,,20040401,4/1/2004,"PH",,,,8072
4329475,4115266,"F",70,,"4329475-3",20020629,6/29/2002,20031218,12/18/2003,20040401,4/1/2004,"EXP",698880,"US-MERCK-0312USA02103","MERCK HUMAN HEALTH DIVISION",43,"YR","M","Y",89,"KG",20040401,4/1/2004,"MD",,,,7768
4329476,4117500,"F",70,,"4329476-5",20030606,6/6/2003,20040113,1/13/2004,20040401,4/1/2004,"EXP",698880,"FR-MERCK-0401FRA00025","MERCK HUMAN HEALTH DIVISION",76,"YR","M","Y",81,"KG",20040401,4/1/2004,"MD",,,,7768
4329478,4117501,"F",70,,"4329478-9",20040301,3/1/2004,20040325,3/25/2004,20040401,4/1/2004,"EXP",698880,"FR-MERCK-0403FRA00102","MERCK HUMAN HEALTH DIVISION",68,"YR","M","Y",,,20040401,4/1/2004,"MD",,,,7768
4329479,4117503,"F",70,,"4329479-0",20000112,1/12/2000,20030130,1/30/2003,20040401,4/1/2004,"EXP",698880,"US-MERCK-0302USA00009","MERCK HUMAN HEALTH DIVISION",65,"YR","M","Y",70,"KG",20040401,4/1/2004,"MD",,,,7768
4329481,4117505,"F",70,,"4329481-9",,,20030323,3/23/2003,20040401,4/1/2004,"EXP",698880,"US-MERCK-0403USA02609","MERCK HUMAN HEALTH DIVISION",,,"M","Y",,,20040401,4/1/2004,"CN",,,,6778
4329482,4117507,"I",72,,"4329482-0",20040220,2/20/2004,20040324,3/24/2004,20040401,4/1/2004,"EXP",698880,"FR-MERCK-0403FRA00101","MERCK HUMAN HEALTH DIVISION",63,"YR","F","Y",98,"KG",20040401,4/1/2004,"OT",,,,7984
4329485,4117508,"I",72,,"4329485-6",20040304,3/4/2004,20040330,3/30/2004,20040401,4/1/2004,"EXP",698880,"IT-MERCK-0403ITA00044","MERCK HUMAN HEALTH DIVISION",70,"YR","F","Y",,,20040401,4/1/2004,"OT",,,,7984
4329545,4108021,"F",70,,"4329545-X",20010908,9/8/2001,20040304,3/4/2004,20040401,4/1/2004,"EXP",698880,"JP-BRISTOL-MYERS SQUIBB COMPANY-12524682","BRISTOL-MYERS SQUIBB COMPANY",47,"YR","F","Y",,,20040401,4/1/2004,"MD",20020118,,,7768
4329548,4117520,"I",72,,"4329548-5",20040326,3/26/2004,20040330,3/30/2004,20040401,4/1/2004,"EXP",698880,"IT-BRISTOL-MYERS SQUIBB COMPANY-12545596","BRISTOL-MYERS SQUIBB COMPANY",61,"YR","F","Y",,,20040401,4/1/2004,"OT",,,,7984
4329568,3997645,"F",70,,"4329568-0",,,20030910,9/10/2003,20040401,4/1/2004,"EXP",698880,"US-ROCHE-346704","ROCHE",22,"YR","M","Y",64.5999984741211,"KG",20040401,4/1/2004,"MD",,,,7768
4329571,4108058,"F",70,,"4329571-0",20040101,1/1/2004,20040312,3/12/2004,20040401,4/1/2004,"EXP",698880,"JP-ROCHE-361532","ROCHE",49,"YR","M","Y",,,20040401,4/1/2004,"MD",,,,7768
4329572,4076200,"I",72,,"4329572-2",20010101,1/1/2001,20040126,1/26/2004,20040401,4/1/2004,"EXP",698880,"BR-ROCHE-357207","ROCHE",56,"YR","F","Y",108,"KG",20040401,4/1/2004,"CN",,,,6778
4329573,4117529,"F",70,,"4329573-4",20031130,11/30/2003,20031201,12/1/2003,20040401,4/1/2004,"EXP",698880,"BE-ROCHE-353048","ROCHE",70,"YR","M","Y",108,"KG",20040401,4/1/2004,"MD",20031222,,,7768
4329575,4065645,"F",70,,"4329575-8",20040106,1/6/2004,20040113,1/13/2004,20040401,4/1/2004,"EXP",698880,"BR-ROCHE-355750","ROCHE",18,"YR","M","Y",61.2000007629395,"KG",20040401,4/1/2004,"MD",,,,7768
4329577,4042708,"F",70,,"4329577-1",20031201,12/1/2003,20031205,12/5/2003,20040401,4/1/2004,"EXP",698880,"DE-ROCHE-353557","ROCHE",39,"YR","M","Y",78,"KG",20040401,4/1/2004,"MD",,,,7768
4329578,4117530,"F",70,,"4329578-3",20010101,1/1/2001,20031215,12/15/2003,20040401,4/1/2004,"EXP",698880,"BR-ROCHE-354185","ROCHE",58,"YR","F","Y",107,"KG",20040401,4/1/2004,"CN",,,,6778
4329581,4028272,"F",70,,"4329581-3",20030929,9/29/2003,20031112,11/12/2003,20040401,4/1/2004,"EXP",698880,"JP-ROCHE-351347","ROCHE",31,"YR","F","Y",51,"KG",20040401,4/1/2004,"MD",20021111,,,7768
4329583,4117531,"F",70,,"4329583-7",20040101,1/1/2004,20040210,2/10/2004,20040401,4/1/2004,"EXP",698880,"US-ROCHE-358561","ROCHE",,,,"Y",,,20040401,4/1/2004,"MD",,,,7768
4329584,4072401,"F",70,,"4329584-9",20030423,4/23/2003,20040119,1/19/2004,20040401,4/1/2004,"EXP",698880,"JP-ROCHE-356463","ROCHE",61,"YR","F","Y",,,20040401,4/1/2004,"MD",,,,7768
4329586,4112692,"F",70,,"4329586-2",19951006,10/6/1995,20040109,1/9/2004,20040401,4/1/2004,"EXP",698880,"JP-ROCHE-355910","ROCHE",57,"YR","M","Y",,,20040401,4/1/2004,"MD",,,,7768
4329588,4091442,"F",70,,"4329588-6",20031124,11/24/2003,20040212,2/12/2004,20040401,4/1/2004,"EXP",698880,"FR-ROCHE-358651","ROCHE",70,"YR","F","Y",,,20040401,4/1/2004,"CN",20031124,,,6778
4329591,4101645,"F",70,,"4329591-6",20040210,2/10/2004,20040210,2/10/2004,20040401,4/1/2004,"EXP",698880,"JP-ROCHE-358972","ROCHE",66,"YR","M","Y",44,"KG",20040401,4/1/2004,"MD",,,,7768
4329592,4117533,"I",72,,"4329592-8",20030325,3/25/2003,20040323,3/23/2004,20040401,4/1/2004,"EXP",698880,"GB-ROCHE-362311","ROCHE",48,"YR","F","Y",,,20040401,4/1/2004,"MD",20040223,,,7768
4329593,4117534,"F",70,,"4329593-X",20040105,1/5/2004,20040211,2/11/2004,20040401,4/1/2004,"EXP",698880,"US-ROCHE-358847","ROCHE",52,"YR","M","Y",64.9000015258789,"KG",20040401,4/1/2004,"MD",,,,7768
4329598,4105674,"F",70,,"4329598-9",,,20040302,3/2/2004,20040401,4/1/2004,"EXP",698880,"GB-ROCHE-360328","ROCHE",,,"M","Y",,,20040401,4/1/2004,"MD",,,,7768
4329599,4117535,"I",72,,"4329599-0",20040224,2/24/2004,20040324,3/24/2004,20040401,4/1/2004,"EXP",698880,"FR-ROCHE-362473","ROCHE",40,"YR","M","Y",,,20040401,4/1/2004,"CN",,,,6778
4329601,4117536,"I",72,,"4329601-6",,,20040322,3/22/2004,20040401,4/1/2004,"EXP",698880,"US-ROCHE-362563","ROCHE",,,"F","Y",,,20040401,4/1/2004,"MD",,,,7768
4329603,4115204,"F",70,,"4329603-X",20040227,2/27/2004,20040325,3/25/2004,20040401,4/1/2004,"EXP",698880,"TH-ROCHE-362654","ROCHE",40,"YR","F","Y",46,"KG",20040401,4/1/2004,"MD",,,,7768
4329604,4117537,"I",72,,"4329604-1",20030315,3/15/2003,20040323,3/23/2004,20040401,4/1/2004,"EXP",698880,"BR-ROCHE-362491","ROCHE",24,"YR","F","Y",52,"KG",20040401,4/1/2004,"MD",,,,7768
4329606,4117538,"I",72,,"4329606-5",20040115,1/15/2004,20040322,3/22/2004,20040401,4/1/2004,"EXP",698880,"FR-ROCHE-362292","ROCHE",41,"YR","M","Y",,,20040401,4/1/2004,"CN",,,,6778
4329612,4117540,"I",72,,"4329612-0",20031124,11/24/2003,20040325,3/25/2004,20040401,4/1/2004,"EXP",698880,"US-ROCHE-363035","ROCHE",,,"F","Y",,,20040401,4/1/2004,"OT",,,,7984
4329614,4117541,"I",72,,"4329614-4",20040201,2/1/2004,20040324,3/24/2004,20040401,4/1/2004,"EXP",698880,"DE-ROCHE-362673","ROCHE",29,"YR","F","Y",60,"KG",20040401,4/1/2004,"MD",,,,7768
4329615,4117542,"I",72,,"4329615-6",20040311,3/11/2004,20040329,3/29/2004,20040401,4/1/2004,"EXP",698880,"JP-ROCHE-363052","ROCHE",80,"YR","F","Y",,,20040401,4/1/2004,"MD",,,,7768
4329617,4117543,"I",72,,"4329617-X",,,20040323,3/23/2004,20040401,4/1/2004,"EXP",698880,"SE-ROCHE-363250","ROCHE",23,"YR","F","Y",,,20040401,4/1/2004,"CN",,,,6778
4329619,4117544,"I",72,,"4329619-3",20040226,2/26/2004,20040325,3/25/2004,20040401,4/1/2004,"EXP",698880,"IT-ROCHE-362822","ROCHE",69,"YR","M","Y",,,20040401,4/1/2004,,,,,
4329620,4117545,"I",72,,"4329620-X",20030101,1/1/2003,20040322,3/22/2004,20040401,4/1/2004,"EXP",698880,"US-ROCHE-362675","ROCHE",14,"WK","M","Y",4.80000019073486,"KG",20040401,4/1/2004,"OT",,,,7984
4329621,4117546,"I",72,,"4329621-1",20040227,2/27/2004,20040323,3/23/2004,20040401,4/1/2004,"EXP",698880,"JP-ROCHE-362674","ROCHE",24,"YR","F","Y",,,20040401,4/1/2004,"MD",,,,7768
4329633,4117558,"I",72,,"4329633-8",20040105,1/5/2004,20040326,3/26/2004,20040401,4/1/2004,"EXP",698880,"PHRM2004FR01356","NOVARTIS PHARMACEUTICALS CORP.",44,"YR","M","Y",,,20040329,3/29/2004,,,,,
4329636,4117559,"I",72,,"4329636-3",,,20040319,3/19/2004,20040401,4/1/2004,"EXP",698880,"PHEH2004US03242","NOVARTIS PHARMACEUTICALS CORP.",83,"YR","F","Y",,,20040329,3/29/2004,"CN",,,,6778
4329638,4117560,"I",72,,"4329638-7",,,20040326,3/26/2004,20040401,4/1/2004,"EXP",698880,"PHRM2004FR01372","NOVARTIS PHARMACEUTICALS CORP.",25,"YR","F","Y",,,20040330,3/30/2004,,,,,
4329639,4116138,"F",70,,"4329639-9",20031218,12/18/2003,20040128,1/28/2004,20040401,4/1/2004,"EXP",698880,"PHEH2004US01274","NOVARTIS PHARMACEUTICALS CORP.",65,"YR","M","Y",,,20040331,3/31/2004,,,,,
4329642,4109805,"F",70,,"4329642-9",20031015,10/15/2003,20040308,3/8/2004,20040401,4/1/2004,"EXP",698880,"PHRM2004FR01099","NOVARTIS PHARMACEUTICALS CORP.",89,"YR","F","Y",,,20040331,3/31/2004,,,,,
4329650,4104280,"F",70,,"4329650-8",,,20040302,3/2/2004,20040401,4/1/2004,"EXP",698880,"PHBS2004AT03114","NOVARTIS PHARMACEUTICALS CORP.",,,,"Y",,,20040331,3/31/2004,"MD",,,,7768
4329652,4117564,"I",72,,"4329652-1",20040301,3/1/2004,20040326,3/26/2004,20040401,4/1/2004,"EXP",698880,"PHBS2004BR04215","NOVARTIS PHARMACEUTICALS CORP.",,,"F","Y",,,20040331,3/31/2004,"MD",,,,7768
4329653,4108762,"F",70,,"4329653-3",20040225,2/25/2004,20040305,3/5/2004,20040401,4/1/2004,"EXP",698880,"PHRM2004FR01125","NOVARTIS PHARMACEUTICALS CORP.",59,"YR","F","Y",50,"KG",20040331,3/31/2004,"OT",,,,7984
4329654,4078894,"F",70,,"4329654-5",20030910,9/10/2003,20031218,12/18/2003,20040401,4/1/2004,"EXP",698880,"PHBS2003JP14275","NOVARTIS PHARMACEUTICALS CORP.",8,"YR","F","Y",29,"KG",20040331,3/31/2004,"MD",,,,7768